[Swan] Libreswan 3.15 - Compilation Problem

Support Reseau support.net at numlog.fr
Fri Aug 28 10:31:09 UTC 2015



Since the vulnerability CVE-2015-3240 (IKE DoS when using NSS) I tried to
compile libreswan-3.15 on Debian 7. But I can’t; Do you know why :


                -c /root/libreswan-3.15/programs/pluto/crypt_dbg.c

/root/libreswan-3.15/programs/pluto/crypt_dbg.c: In function 'symkey_bytes':

/root/libreswan-3.15/programs/pluto/crypt_dbg.c:102:2: error: implicit
declaration of function 'PK11_Decrypt'

/root/libreswan-3.15/programs/pluto/crypt_dbg.c:102:2: error: nested extern
declaration of 'PK11_Decrypt' [-Werror=nested-externs]

cc1: all warnings being treated as errors

make[3]: *** [crypt_dbg.o] Erreur 1

make[3]: *** Attente des tâches non terminées....

make[3]: quittant le répertoire «
/root/libreswan-3.15/OBJ.linux.x86_64/programs/pluto »

make[2]: *** [local-base] Erreur 2

make[2]: quittant le répertoire « /root/libreswan-3.15/programs/pluto »

make[1]: *** [all] Erreur 2

make[1]: quittant le répertoire « /root/libreswan-3.15/programs »

make: *** [all] Erreur 2





-------------- next part --------------
An HTML attachment was scrubbed...
URL: <https://lists.libreswan.org/pipermail/swan/attachments/20150828/fa1dad2c/attachment.html>

More information about the Swan mailing list